Home > Labview Error > Labview Error 61499

Labview Error 61499

I then reverted back to the original settings for this FIFO and the compilation got past the pre-compilation stage (i.e.. Replace the niFpgaLibrary folder with the one contained in the attached zip file. When I selected the master as startup, the RT starts up normally, TCPIP listeners work, and all is well.Happy developing... 0 Kudos Message 4 of 8 (1,250 Views) Reply 0 Kudos Cheers!TJ G 0 Kudos Message 8 of 14 (1,176 Views) Reply 0 Kudos Re: fpga Jed_Davidow Active Participant ‎12-17-2013 02:00 PM Options Mark as New Bookmark Subscribe Subscribe to RSS Feed Check This Out

Related Links: National Instrument Developer Zone: Cycle Accurate Simulation with Xilinx ISim Attachments: Report Date: 09/16/2011 Last Updated: 02/04/2012 Document ID: 5PF6EH44 Your Feedback! Solution: This error is due to an incorrect FPGA simulation library shipped with LabVIEW FPGA 2010 SP1. My code is a Queue based producer/consumer with 4 additional while loops all running in parallel. But still i cannot compile. directory

For example the NIFPGA2009\Xilinx\ISE folder should be about 3.74 GB. I'm not seeing a lot of documentation on Error -61499, but I did notice that the last line in Knowledgebase: Error -61499 in LabVIEW FPGA sounds similar to your resolution of Please Contact NI for all product and support inquiries. All rights reserved. | United States MY ACCOUNT   INNOVATIONS SHOP SUPPORT COMMUNITY Home Community Home : Most Active Software Boards : LabVIEW : error code -61499 LabVIEW Register for the

So I am here uninstalling all 2012/2013 FPGA and RT modules, and I will have to reinstall them when I am done.GET YOUR ACT TOGETHER. 0 Kudos Message 10 of 14 Login or Signup Now to post comments Related Posts NVIDIA 3D Vision video playerError in Installation of Eclipse IDEProblem occurred with Multiple Arcade Machine EmulatorError 1001- No devices foundTelerik-webUI Test Studio My Profile | RSS | Privacy | Legal | Contact NI © 2014 National Instruments Corporation. Related Links: KnowledgeBase 3WRFDHJ4: Error -61499 in LabVIEW FPGAKnolwedgeBase 5FBCBNEQ: Error -61499 when Compiling an FPGA VI Using Hybrid Mode with CompactRIO Attachments: Report Date: 03/16/2012 Last Updated: 12/01/2012 Document ID:

Thanks 0 Kudos Message 5 of 6 (863 Views) Reply 0 Kudos Re: error code -61499 VTHokie Member ‎06-21-2010 12:46 PM Options Mark as New Bookmark Subscribe Subscribe to RSS Feed In the properties window select Xilinx Options from the Category section. Help about websites powered by How to solve Windows Activation Give me example of application Error appears when tries to login How to create php press release Home > Solution Categories http://digital.ni.com/public.nsf/allkb/60CCBE0D8D6C844E862579C3006265E4 Please tell us why.

Please tell us why. In order to fix the error, you can delete and re-create the affected FPGA nodes. During compilation, I receive the following error:Error -61499 occurred at an unidentified locationPossible reason(s):LabVIEW FPGA: An internal software error in the LabVIEW FPGA Module has occurred. Just to see, installed on another network machine, an i7.

Please contact National Instruments technical support at ni.com/support.=========================LabVIEW FPGA: An internal software error in the LabVIEW FPGA Module has occurred. http://digital.ni.com/public.nsf/allkb/5B8827503F7D90F386257BEA002D8E99 It is urgent, please. File was not found. The memory error I encountered in LV2011 SP1 eventually stopped occuring, or at least occurred so infrequently as to allow me to complete the development task.

You can also try deleting the file perl58.dll as that is the problem that is causing the problem. http://cygnussoft.com/labview-error/labview-error-88705.html If you have an urgent issue its better to post a new thread. You can do this by going to Measurement & Automation Explorer (MAX), ensuring My System is expanded, right-click Software on the menu on the left hand side of the Window and To do this right-click on the build specifications section under the FPGA target in your project and select Properties.

However sooner or later I get the problem again and I switch target again. All the best, MaxApplications EngineerNational Instruments 0 Kudos Message 2 of 14 (1,337 Views) Reply 0 Kudos Re: fpga redfrank Member ‎12-12-2013 11:12 AM Options Mark as New Bookmark Subscribe Subscribe Title: * Questions: * Email id: Math question: * 9 + 5 = Solve this simple math problem and enter the result. this contact form I have the problem fixed, at least I am able to compile the FPGA code.

I'm not getting the -61499 error any more and the FPGA code compiled and seems to be running fine BUT once out of every 3 or 4 attempts to run my I did see one of those but it didn't seem to apply. What's going on here?

Does this sound like my Labview Install is hosed up and my Xilinx compiler is missing or broken?

I then created a new 7833R target in my project, copied all code, FIFOs etc across and recompiled - this time it compiled ok. As for the problem, did you look at the ideas that the previous poster added? All rights reserved. | Cart|Help KnowledgeBase Request Supportfrom an engineer NIHome > Support > KnowledgeBase English 1 rating: 1 out of 5   Error-61499 occurred About a week ago, I got a strange pre-compile stage error stating that there was a problem with one of the FIFOs - it saidthere wereonly 2 elements assigned tothe FIFO

I hope this helps! - Greg J 0 Kudos Message 6 of 6 (816 Views) Reply 0 Kudos All Forum Topics Previous Topic Next Topic Privacy | Terms I could understand if the PC was right on the 2Gblimit while compiling and sometimes getting nudged just over, but that isn't what's happening as a successful compile stays at 1.2Gb Make sure that it is installed here and not somewhere with a deep path or any foreign characters in the directory name. -----David_L | Certified LabVIEW Architect | Senior Product ManagerLabVIEW http://cygnussoft.com/labview-error/labview-error-50202.html I did a research on this issue and I confirm that sometimes (depending on the size of the project) 2GB of RAM is not enough to successfully compile the project.

this FIFO issue cleared), however after about 5 minutes the compile returned an error stating theXilinx tool had run out of memory (2Gb of RAM fitted to this machine). Please Contact NI for all product and support inquiries. Show Search Box Search: * Quick Links Links My posts Test your skills Recent posts Create content Article Blog entry Questions Tips Top Posts Latest postMost read How To Fix Dell Having fixed the timing violation, I again encountered this memory issue - this time I watched the graph on task manager, and could see immediately on starting the compile, memory was

I remember, i also had it on the first installation. Please Contact NI for all product and support inquiries. neutronjohn Member ‎09-13-2009 01:05 PM Options Mark as New Bookmark Subscribe Subscribe to RSS Feed Highlight Print Email to a Friend Report to a Moderator Problem Description :I have a cRIO Ruhmann Member ‎09-14-2009 10:22 AM Options Mark as New Bookmark Subscribe Subscribe to RSS Feed Highlight Print Email to a Friend Report to a Moderator It clearly looks like an installation

Let us know if you see this again. Answered Your Question? 1 2 3 4 5 Document needs work? Another test: Created a very simple VI, nothing but two I16s adding, no loop. Anybody have some thoughts on how to clear this? 0 Kudos Message 1 of 6 (937 Views) Reply 0 Kudos Re: error code -61499 Ray.R Knight of NI ‎06-17-2010 12:26 PM

My Profile | RSS | Privacy | Legal | Contact NI © 2014 National Instruments Corporation. E.g. Duringplacingand routing, I receivethe following error:LabVIEW FPGA: An internal software error in the LabVIEW FPGA Module has occurred. Please contact National Instruments technical support at ni.com/support.Additional Information: This timing violation is other than Period()This timing violation is other than Period()Return Code:-3003Why am I seeing this error, and what I

All Rights Reserved.

United States MY ACCOUNT   INNOVATIONS SHOP SUPPORT COMMUNITY Home Community Home : Most Active Software Boards : LabVIEW : fpga LabVIEW Register for the community · The bitfile generated during this compilation was functional. Please tell us why. Switching does seem to temporarily fix the problem, if I stay with the same target the problem does seem to repeat.

Answered Your Question? 1 2 3 4 5 Document needs work? Attachments: Report Date: 04/28/2006 Last Updated: 03/16/2012 Document ID: 3WRFDHJ4 Your Feedback! The code has been compiling OK until recently, taking about 20 minutes. Answered Your Question? 1 2 3 4 5 Document needs work?